Google cloudStorage Suffering Error

:app:processDebugManifest :app:processDebugResources :app:generateDebugSources :app:compileDebugJava :app:preDexDebug trouble processing "javax/transaction/HeuristicCommitException.class": Ill-advised or mistaken usage of a core class (java.* or javax.*) when not building a core library.

This is often due to inadvertently including a core library file in your application's project, when using an IDE (such as Eclipse). If you are sure you're not intentionally defining a core class, then this is the most likely explanation of what's going on.

However, you might actually be trying to define a class in a core namespace, the source of which you may have taken, for example, from a non-Android virtual machine project. This will most assuredly not work. At a minimum, it jeopardizes the compatibility of your app with future versions of the platform. It is also often of questionable legality.

If you really intend to build a core library -- which is only appropriate as part of creating a full virtual machine distribution, as opposed to compiling an application -- then use the "--core-library" option to suppress this error message. If you go ahead and use "--core-library" but are in fact building an application, then be forewarned that your application will still fail to build or run, at some point. Please be prepared for angry customers who find, for example, that your application ceases to function once they upgrade their operating system. You will be to blame for this problem.

If you are legitimately using some code that happens to be in a core package, then the easiest safe alternative you have is to repackage that code. That is, move the classes in question into your own package namespace. This means that they will never be in conflict with core system classes. JarJar is a tool that may help you in this endeavor. If you find that you cannot do this, then that is an indication that the path you are on will ultimately lead to pain, suffering, grief, and lamentation.

1 error; aborting Error:Execution failed for task ':app:preDexDebug'. > org.gradle.process.internal.ExecException: Process 'command 'C:\Program Files\Java\jdk1.8.0_25\bin\java.exe'' finished with non-zero exit value 1 Information:BUILD FAILED Information:Total time: 1 mins 29.785 secs Information:1 error Information:2 warnings Information:See complete output in console

I have Tried Almost every jar

using this tutorial

Category:java Views:3 Time:2018-09-11

Related post

  • Google Geocoding API error: You are over your quota 2012-03-23

    I´m working with google maps, and i have problems with my quota. How can i fix this? the message i got from my hompage is: Google Geocoding API error: You are over your quota I read thats something with the daily limit of 2500 pr. IP. on the page whe

  • gwt to call google places api error:invalid label:"html_attributions" 2012-03-31

    This question has been asked here(and several other places): google places api error with jquery ajax call... html_attributions same as his case,I can see response coming back fine in firbug's json tab,and difference is I do add "callback",but still

  • IE 9 cannot go to, 404 error 2012-05-05

    my cuestion is what is 404 google error ? Split from: --------------Solutions------------- Hi, The 404 er

  • trying to install google earth get error 0x80040905____ 2012-08-18

    Remember - This is a public forum so never post private information such as email or phone numbers! Ideas: Programs you are having problems with google earth Error messages0x80040905 Recent changes you made to your computerupgraded from vista to wind

  • Unable to download Google Chrome, receiving error: System.ComponentModel.Win32Exception: No application is associated with the specified file for this operation. 2013-03-24

    Original Title: I am trying to download Google Chrome but it doesn't let me. I dowload it and this comes out: System.ComponentModel.Win32Exception: No application is associated with the specified file for this operation at System.Diagnostics.Process.

  • Install Google Earth without Error 0x80040905 2014-01-03

    Install Google Earth without Error 0x80040905 --------------Solutions------------- Hi, 1. Which version of Google earth are you using? 2. Were you able to use Google earth without any issues on windows 7 earlier? 3. When exactly do you get this error

  • Google Chrome Update Error 2014-03-22

    Google Chrome is saying there's an error. Screenshot: Screenshot by Lightshot Anyone know how to fix this? --------------Solutions------------- This link might help: How to Fix Google Chrome Update Error 3 on Windows 7 Originally Posted by David Bail

  • google update installer error code 0x80070032 2015-03-11

    i can not install google chrome browser on my vista computer and with a message that google update installer error code 0x80070032. why and how i can install --------------Solutions------------- Suggest you seek assistance from Google Support at http

  • Review Aggregate Google Rich Snippet - Error with review count 2013-10-02

    I have successfully implemented Google Rich Snippets on my web pages. But when I tried to use review aggregate Snippets, it gives me the below error: "If count is specified in review aggregate, page should contain reviews. Otherwise you may want to u

  • Google closure compiler error "Variable COMPILED first declared in {SyntheticVarsDeclar}" 2009-11-07

    When using the Google closure compiler to try and compile a load of closure dependencies taken from their editor demo (no external code) using I get the following error when then running the compiler on the produced code (which runs fine)

  • Google check out error 2009-12-10

    I want to implement Google checkout in my PHP project (running on Apache). I put the callback URL in my merchant center account. My Checkout is in sandbox mode. When placing an order I get the following error message in my merchant center: We encount

  • Google Map View Error when running - Droid 2010-01-15

    I want to learn some programming for my android phone. I was successful doing the hello world app. Now I wanted to try the mapview found here: My code is the following: package

  • Google Map API Errors 2010-03-02

    I'm creating a dynamic map with the Google Maps API and I'm getting hard to understand errors from only certain markers. My page is located at: My (long) java script source file is loc

  • google app engine error ,and i can't open it now.(python) 2010-04-15

    the error is : Errors occurred See the logfile 'D:\Program Files\Google\google_appengine\launcher\GoogleAppEngineLauncher.exe.log' for details why ? thanks --------------Solutions------------- Find your home directory (open command prompt, run "set h

  • Rails on Google App Engine - Error on OS X development machine 2010-04-19

    I'm running through the Ruby on Rails tutorial at (adjusting where appropriate for Google's App Engine). All is well up till section 6.3: when I try to click "New Post", I get the following error: In

  • jQuery getScript and Google Maps API Error message 2010-06-03

    I got a problem with loading the google maps api. I got my own object with a function that initializes the map, and the google maps api gets loaded via jquery.getscript. but i always get an error message in the callback function: var MyGMap = { GMapS

  • Google App Engine error Object Manager has been closed 2010-06-03

    I had following error from Google App Engine when I was trying to iterate list in JSP page with EL. Object Manager has been closed I solved problem with following code, but I don't think that it is very good solution to this problem: public List<I

  • Google App Engine: "Error: Server Error" but nothing in the logs 2010-07-03

    I deployed an app to Google App Engine. When I navigate to it, I get this: Error: Server Error The server encountered an error and could not complete your request. If the problem persists, please report your problem and mention this error message and

  • google buzz api error 2010-07-20

    I am trying to post some content to my google buzz account using google buzz api. I tried using their sample code that they have provided ,but it give the below error Array ( [http_code] => 401 [headers] => Array ( [WWW-Authenticate] => Auth

  • Google Checkout reports error to user but not admin 2010-07-27

    I'm using the following to generate a Google Checkout: echo '<form method="POST" action="'.$id.'" accept-charset="utf-8">'; while ($row = mysql_fetch_array($result)) { ec

  • Mercurial Push Error on Google Code Value Error 2010-09-03

    I am trying to learn to use mercurial by pushing onto Google code. I have two .hgrc files: One file is located $PROJECT_DIR/.hg/.hrgc and $HOME/.hgrc. I have two separate files because I did not want to put the password out on the central repository.

  • Push notification c# google code showing error "File not found" every time.? 2010-10-11

    I need to use c# code for Server of Push notification Service. i have also downloaded Source code from google Source code. there are 3 zip files available . I am using latest Apns-Sharp- but when I am testing it, it gives a "File not

  • ASP.NET & Google Maps API Error Code "620"on shared hosting 2010-10-14

    We have a Map It feature on a Real Estate Website and its on a Shared Host, the feature basically shows you the location of a property of works fine for a few hours a day but it stops working later in the day because of error Code "620" for the map r

  • google map API error.. so annoying 2010-12-22

    the website i developed yields the following error for street view google API: This web site needs a different Google Maps API key. A new key can be generated at I have tried to register the API using "www.mydomain.c

  • Google Checkout TIMEOUT error 2011-01-12

    periodicly i got error in my Google Checkout Integration Console: We encountered an error trying to access your server at -- the error we got is Error 'TIMEOUT' connecting to url 'http

Copyright (C), All Rights Reserved.

processed in 0.172 (s). 11 q(s)